Watch, Follow, &
Connect with Us

For forums, blogs and more please visit our
Developer Tools Community.


Welcome, Guest
Guest Settings
Help

Thread: [ilink32 Error] Fatal: Unable to open file '.LIB' (C++Builder XE6)


This question is not answered. Helpful answers available: 2. Correct answers available: 1.


Permlink Replies: 8 - Last Post: May 29, 2017 12:55 PM Last Post By: Daniel Franke
Markus Svilans

Posts: 5
Registered: 2/23/04
[ilink32 Error] Fatal: Unable to open file '.LIB' (C++Builder XE6)  
Click to report abuse...   Click to reply to this thread Reply
  Posted: Jan 18, 2016 9:54 AM
Has anybody experienced this?

[ilink32 Error] Fatal: Unable to open file '.LIB'

The C++Builder project will compile without any errors but at the link stage it will produce this error message.
This error started appearing randomly for me, and now it happens all the time. I'm now left in the uncomfortable position of being unable to provide bug fixes and updates to my customers.

Here is a list of things I've tried:
- reinstalled C++ Builder
- recreated the .cbproj file from scratch
- building on a different computer
- uninstalling all 3rd party components from C++Builder IDE
- cleaning the project, then rebuilding
- deleting the entire build output directory
- rebooting the computer

These things will sometimes randomly make the error go away. At that point, I can rebuild the project a few times, before the error comes back by itself.

This error will even occur on brand new, blank projects (File -> New Project -> VCL Forms Application) so I'm pretty sure it's not anything specific to my project.

Here is the ilink32 command line and error from an empty VCL Forms Application project:
ilink32 command line
  d:\program files (x86)\embarcadero\studio\14.0\bin\ilink32.exe -G8 -L.\Win32\Debug;"d:\program files (x86)\embarcadero\studio\14.0\lib\Win32\debug";
  "d:\program files (x86)\embarcadero\studio\14.0\lib\win32\Debug";"d:\program files (x86)\embarcadero\studio\14.0\lib\win32\Debug\psdk";
  "F:\WorkingDir\daq-base-visual\Win32\Debug";"C:\Program Files (x86)\Steema Software\TeeChart Lite 2014 for RAD XE6\Delphi20.win32\Lib";"C:\Program 
  Files (x86)\Steema Software\TeeChart Lite 2014 for RAD XE6\Delphi20.win32\Lib\Obj";C:\Users\Public\Documents\Embarcadero\Studio\14.0\DCP 
  -j.\Win32\Debug;"d:\program files (x86)\embarcadero\studio\14.0\lib\Win32\debug";"d:\program files (x86)\embarcadero\studio\14.0\lib\win32\Debug";
  "d:\program files (x86)\embarcadero\studio\14.0\lib\win32\Debug\psdk";"F:\WorkingDir\daq-base-visual\Win32\Debug";"C:\Program Files (x86)\Steema 
  Software\TeeChart Lite 2014 for RAD XE6\Delphi20.win32\Lib";"C:\Program Files (x86)\Steema Software\TeeChart Lite 2014 for RAD 
  XE6\Delphi20.win32\Lib\Obj";C:\Users\Public\Documents\Embarcadero\Studio\14.0\DCP -l.\Win32\Debug -v 
  -GA"C:\Users\Markus\AppData\Local\Temp\vfsFAC0.tmp"="C:\Users\Markus\Documents\Embarcadero\Studio\Projects\Unit1.dfm" -aa -V5.0 -Tpe  c0w32w rtl.bpi 
  vcl.bpi memmgr.lib sysinit.obj .\Win32\Debug\Project1.obj .\Win32\Debug\Unit1.obj , .\Win32\Debug\Project1.exe , .\Win32\Debug\Project1.map , 
  import32.lib cp32mti.lib , , Project1.res 
[ilink32 Error] Fatal: Unable to open file '.LIB'


My environment:
C++Builder XE6 Professional
Version 20.0.16277.1276
Delphi XE6 and C++BuilderXE6 Update 1
Windows 7 64-bit

Any help would be very appreciated.
I'm losing my mind and risking losing business.

Thank you,
Markus
Markus Svilans

Posts: 5
Registered: 2/23/04
Re: [ilink32 Error] Fatal: Unable to open file '.LIB' (C++Builder XE6)  
Click to report abuse...   Click to reply to this thread Reply
  Posted: Jan 19, 2016 8:11 AM   in response to: Markus Svilans in response to: Markus Svilans
Update:

Last night I created a brand new, clean Win7 Pro 32-bit VirtualBox VM, and installed C++ Builder XE6 Update 1 from the downloaded ISO image.

The exact same thing happened:
- project builds fine the first few times
- after rebooting the VM, the same error is back: [ilink32 Error] Fatal: Unable to open file '.LIB'
- error happens even on brand new VCL Forms Applications projects

???????

The way it is, either I have a complete inability to install XE6, or XE6 is completely unable to build software.
Any help or shared experiences would be appreciated.
Markus Svilans

Posts: 5
Registered: 2/23/04
Re: [ilink32 Error] Fatal: Unable to open file '.LIB' (C++Builder XE6)  
Click to report abuse...   Click to reply to this thread Reply
  Posted: Jan 19, 2016 8:47 AM   in response to: Markus Svilans in response to: Markus Svilans
Here is the output when building my dummy test project, which also fails with the same error, using the command line:

msbuild Project1.cbproj /v:diag /t:make

---
Microsoft (R) Build Engine Version 3.5.30729.5420
[Microsoft .NET Framework, Version 2.0.50727.5420]
Copyright (C) Microsoft Corporation 2007. All rights reserved.
 
Overriding target "ResolveFiles" in project "C:\Program Files\Embarcadero\Studio\14.0\bin\CodeGear.Common.Targets" with target "ResolveFiles" from project "C:\Program Files\Embarcadero\Studio\14.0\Bin\CodeGear.Cpp.Targets".
Overriding target "Build" in project "C:\Program Files\Embarcadero\Studio\14.0\bin\CodeGear.Common.Targets" with target "Build" from project "C:\Program Files\Embarcadero\Studio\14.0\Bin\CodeGear.Cpp.Targets".
Overriding target "Clean" in project "C:\Program Files\Embarcadero\Studio\14.0\bin\CodeGear.Common.Targets" with target "Clean" from project "C:\Program Files\Embarcadero\Studio\14.0\Bin\CodeGear.Cpp.Targets".
Overriding target "default" in project "C:\Program Files\Embarcadero\Studio\14.0\bin\CodeGear.Common.Targets" with target "Default" from project "C:\Program Files\Embarcadero\Studio\14.0\Bin\CodeGear.Cpp.Targets".
Build started 1/19/2016 11:42:29 AM.
Project "C:\WorkingDir\TestProj\Project1.cbproj" on node 0 (make target(s)).
Initial Properties:
__Manifest_File = C:\Program Files\Embarcadero\Studio\14.0\bin\default_app.manifest
__MetadataName = Identity
_EvaluateItemDependsOnTargets = 
      
      _ResolveInput;
      _ResolveOutput;
    
    
_EvaluateOutputsDependsOnTargets = 
      
      _ResolveInput;
      _ResolveOutput;
    ;
      _GatherOutputs;
    
_EvaluatePropertyDependsOnTargets = 
      _ResolveInput;
      _ResolveOutput;
    
_KibitzItemNames = BCC32_CmdLine;BRCC32_CmdLine;TASM32_CmdLine;BCC_CmdLine;IDEDepCheck;EvaluateProperty;EvaluateItem
_OutputDRCFiles = false
_ResolveGENTLBBindingsTarget = 
      _ResolveGENTLBBindings;
    
_ResolveOutputDependsOn = 
       BuildShouldBuildVersion;
      _ResolveIcons;
      _ResolveCompiledOutput;
      _ResolveOther;
    
_TCHARMapping = wchar_t
AllPackageLibs = rtl.lib;vcl.lib
ALLUSERSPROFILE = C:\ProgramData
APPDATA = C:\Users\Thunderclump\AppData\Roaming
AppDataDir = C:\Users\Thunderclump\AppData\Roaming\Embarcadero\BDS\14.0\
AppType = Application
Base = true
Base_Win32 = true
BCB = c:\program files\embarcadero\studio\14.0
BCC_DebugLineNumbers = true
BCC_Defines = _DEBUG;
BCC_DisableFramePtrElimOpt = true
BCC_DisableOptimizations = true
BCC_DisableSpellChecking = true
BCC_EnableCPPExceptions = true
BCC_ExtendedErrorInfo = true
BCC_GenerateMultithreaded = true
BCC_GenerateUnicode = true
BCC_GenerateWindowsApp = true
BCC_IncludePath = C:\Program Files\Embarcadero\Studio\14.0\include\windows\vcl;;C:\Program Files\Embarcadero\Studio\14.0\include\boost_1_39\boost\tr1\tr1;C:\Program Files\Embarcadero\Studio\14.0\include\boost_1_39;C:\Program Files\Embarcadero\Studio\14.0\include;C:\Program Files\Embarcadero\Studio\14.0\include\dinkumware;C:\Program Files\Embarcadero\Studio\14.0\include\windows\crtl;C:\Program Files\Embarcadero\Studio\14.0\include\windows\sdk;C:\Program Files\Embarcadero\Studio\14.0\include\windows\rtl;C:\Program Files\Embarcadero\Studio\14.0\include\windows\vcl;C:\WorkingDir\DaqBaseVisual
BCC_InlineFunctionExpansion = false
BCC_InternalDefines = USEPACKAGES
BCC_LinkWithDynamicRTL = true
BCC_NoLink = true
BCC_OptimizeForSpeed = false
BCC_OutputDir = .\Win32\Debug\
BCC_PCHName = .\Win32\Debug\Project1.pch
BCC_ReplaceHeaderName = 
BCC_SourceDebuggingOn = true
BCC_StackFrames = true
BCC_UseRegisterVariables = None
BCC_UTF8Output = true
BCC_wpar = false
BDS = C:\Program Files\Embarcadero\Studio\14.0
BDSAppDataBaseDir = BDS
BDSBIN = c:\program files\embarcadero\studio\14.0\bin
BDSCOMMONDIR = C:\Users\Thunderclump\Documents\Embarcadero\Studio\14.0
BDSINCLUDE = C:\Program Files\Embarcadero\Studio\14.0\include
BDSLIB = c:\program files\embarcadero\studio\14.0\lib
BDSPLATFORMSDKSDIR = C:\Users\Thunderclump\Documents\Embarcadero\Studio\SDKs
BDSPROFILESDIR = C:\Users\Thunderclump\Documents\Embarcadero\Studio\Profiles
BDSPROJECTSDIR = C:\Users\Thunderclump\Documents\Embarcadero\Studio\Projects
BDSUSERDIR = C:\Users\Thunderclump\Documents\Embarcadero\Studio\14.0
BpiExt = bpi
BpiOutput = 
BplExt = bpl
BplOutput = 
BplPlatformPrefix = 
BRCC_Defines = _DEBUG;
BRCC_IncludePath = C:\Program Files\Embarcadero\Studio\14.0\include\windows\vcl;
BRCC_OutputDir = .\Win32\Debug\
BuildDependsOn = 
      BeforeBuild;
      CoreBuild;
      AfterBuild
    
BuildDependsOnTargets = 
      _ForceRebuild;
      CleanLinkerStateFiles;
      
      ;_VerifyProfileFile;_CheckPlatformSDK;
      _CheckPlatformVariable;
      _MakePreReq;
      _ResolveOutput;
      CreateDirectories;
      _RunUserTools;
      PreBuildEvent;
      _PreOutputTimeStamp;
      MakeObjs;
      Link;
      _PostOutputTimeStamp;
      MakeStaticPackage;
      PostBuildEvent
    ;
      AutoIncBuildNumber
    
BuildOneDependsOnTargets = 
      _ForceRebuild;
      
      ;_VerifyProfileFile;_CheckPlatformSDK;
      _ResolveConfiguration;
      _MakeOnePreReq;
      _ResolveInput;
      _ResolveFileToCompile;
      CreateDirectories;
      PreBuildEvent;
      _PreOutputTimeStamp;
      _MakeOne;
      _PostOutputTimeStamp;
      PostBuildEvent;
    ;
    
CBuilderBPIOutputPath = C:\Users\Thunderclump\Documents\Embarcadero\Studio\14.0\DCP
CBuilderBPLOutputPath = C:\Users\Thunderclump\Documents\Embarcadero\Studio\14.0\BPL
CBuilderBrowsingPath = C:\Program Files\Embarcadero\Studio\14.0\SOURCE\VCL;C:\Program Files\Embarcadero\Studio\14.0\source\vcl\bcbsamples;C:\Program Files\Embarcadero\Studio\14.0\source\vcl\jpg\src;C:\Program Files\Embarcadero\Studio\14.0\source\rtl\common;C:\Program Files\Embarcadero\Studio\14.0\SOURCE\RTL\SYS;C:\Program Files\Embarcadero\Studio\14.0\source\rtl\win;C:\Program Files\Embarcadero\Studio\14.0\source\ToolsAPI;C:\Program Files\Embarcadero\Studio\14.0\SOURCE\IBX;C:\Program Files\Embarcadero\Studio\14.0\source\Internet;C:\Program Files\Embarcadero\Studio\14.0\SOURCE\PROPERTY EDITORS;C:\Program Files\Embarcadero\Studio\14.0\source\soap;C:\Program Files\Embarcadero\Studio\14.0\SOURCE\XML;C:\Program Files\Embarcadero\Studio\14.0\source\data;C:\Program Files\Embarcadero\Studio\14.0\source\Indy10\Core;C:\Program Files\Embarcadero\Studio\14.0\source\Indy10\System;C:\Program Files\Embarcadero\Studio\14.0\source\Indy10\Protocols;C:\Program Files\Embarcadero\Studio\14.0\source\ComServers;C:\Program Files\Embarcadero\Studio\14.0\source\ComServers\ie5;C:\Program Files\Embarcadero\Studio\14.0\source\ComServers\Office2k;C:\Program Files\Embarcadero\Studio\14.0\source\ComServers\OfficeXP;C:\Program Files\Embarcadero\Studio\14.0\source\cpprtl\rtlinc;C:\Program Files\Embarcadero\Studio\14.0\source\cpprtl\Source\conio;C:\Program Files\Embarcadero\Studio\14.0\source\cpprtl\Source\cstrings;C:\Program Files\Embarcadero\Studio\14.0\source\cpprtl\Source\defs;C:\Program Files\Embarcadero\Studio\14.0\source\cpprtl\Source\dinkumware\source;C:\Program Files\Embarcadero\Studio\14.0\source\cpprtl\Source\dinkumware\source\tr1;C:\Program Files\Embarcadero\Studio\14.0\source\cpprtl\Source\except;C:\Program Files\Embarcadero\Studio\14.0\source\cpprtl\Source\io;C:\Program Files\Embarcadero\Studio\14.0\source\cpprtl\Source\locale;C:\Program Files\Embarcadero\Studio\14.0\source\cpprtl\Source\math;C:\Program Files\Embarcadero\Studio\14.0\source\cpprtl\Source\mbcs;C:\Program Files\Embarcadero\Studio\14.0\source\cpprtl\Source\memory;C:\Program Files\Embarcadero\Studio\14.0\source\cpprtl\Source\misc;C:\Program Files\Embarcadero\Studio\14.0\source\cpprtl\Source\pcre;C:\Program Files\Embarcadero\Studio\14.0\source\cpprtl\Source\process;C:\Program Files\Embarcadero\Studio\14.0\source\cpprtl\Source\startup;C:\Program Files\Embarcadero\Studio\14.0\source\cpprtl\Source\threads;C:\Program Files\Embarcadero\Studio\14.0\source\cpprtl\Source\time;C:\Program Files\Embarcadero\Studio\14.0\source\cpprtl\Source\vcl;C:\Program Files\Embarcadero\Studio\14.0\source\data\dsnap\midas;C:\Program Files\Embarcadero\Studio\14.0\source\fmx;C:\Program Files\Embarcadero\Studio\14.0\source\databinding\components;C:\Program Files\Embarcadero\Studio\14.0\source\databinding\engine;C:\Program Files\Embarcadero\Studio\14.0\source\databinding\graph;C:\Program Files\Embarcadero\Studio\14.0\source\data;C:\Program Files\Embarcadero\Studio\14.0\source\data\ado;C:\Program Files\Embarcadero\Studio\14.0\source\data\bde;C:\Program Files\Embarcadero\Studio\14.0\source\data\cloud;C:\Program Files\Embarcadero\Studio\14.0\source\data\datasnap;C:\Program Files\Embarcadero\Studio\14.0\source\data\dbx;C:\Program Files\Embarcadero\Studio\14.0\source\data\dsnap;C:\Program Files\Embarcadero\Studio\14.0\source\data\Test;C:\Program Files\Embarcadero\Studio\14.0\source\data\vclctrls;C:\Program Files\Embarcadero\Studio\14.0\source\data\datasnap\connectors;C:\Program Files\Embarcadero\Studio\14.0\source\data\datasnap\proxygen;C:\Program Files\Embarcadero\Studio\14.0\source\DataExplorer;C:\Program Files\Embarcadero\Studio\14.0\source\DUnit\Contrib\DUnitWizard\Source\Common;C:\Program Files\Embarcadero\Studio\14.0\source\DUnit\Contrib\DUnitWizard\Source\Common\dunit;C:\Program Files\Embarcadero\Studio\14.0\source\DUnit\Contrib\DUnitWizard\Source\DelphiExperts\Common;C:\Program Files\Embarcadero\Studio\14.0\source\DUnit\Contrib\DUnitWizard\Source\DelphiExperts\DUnitProject;C:\Program Files\Embarcadero\Studio\14.0\source\DUnit\Contrib\DUnitWizard\Source\DelphiExperts\DUnitProject\dunit;C:\Program Files\Embarcadero\Studio\14.0\source\DUnit\src;C:\Program Files\Embarcadero\Studio\14.0\source\DUnit\tests;C:\Program Files\Embarcadero\Studio\14.0\source\Experts;C:\Program Files\Embarcadero\Studio\14.0\source\indy\abstraction;C:\Program Files\Embarcadero\Studio\14.0\source\indy\implementation;C:\Program Files\Embarcadero\Studio\14.0\source\indyimpl;C:\Program Files\Embarcadero\Studio\14.0\source\LiveTile;C:\Program Files\Embarcadero\Studio\14.0\source\Property Editors\Indy10;C:\Program Files\Embarcadero\Studio\14.0\source\soap\wsdlimporter;C:\Program Files\Embarcadero\Studio\14.0\source\Visualizers;C:\Program Files\Embarcadero\Studio\14.0\source\xtab;C:\Program Files\Embarcadero\Studio\14.0\source\DUnit\Contrib\XMLReporting;C:\Program Files\Embarcadero\Studio\14.0\source\DUnit\Contrib\XPGen;C:\Program Files\Embarcadero\Studio\14.0\source\data\firedac;C:\Program Files\Embarcadero\Studio\14.0\source\tethering
CBuilderIncludePath = C:\Program Files\Embarcadero\Studio\14.0\include\boost_1_39\boost\tr1\tr1;C:\Program Files\Embarcadero\Studio\14.0\include\boost_1_39;C:\Program Files\Embarcadero\Studio\14.0\include;C:\Program Files\Embarcadero\Studio\14.0\include\dinkumware;C:\Program Files\Embarcadero\Studio\14.0\include\windows\crtl;C:\Program Files\Embarcadero\Studio\14.0\include\windows\sdk;C:\Program Files\Embarcadero\Studio\14.0\include\windows\rtl;C:\Program Files\Embarcadero\Studio\14.0\include\windows\vcl;C:\WorkingDir\DaqBaseVisual
CBuilderLibraryPath = C:\Users\Public\Documents\Embarcadero\Studio\14.0\DCP\;c:\program files\embarcadero\studio\14.0\lib\win32\release;c:\program files\embarcadero\studio\14.0\lib\win32\release\psdk
CBuilderNoRefactorPath = 
CBuilderUserIncludePath = 
Cfg_1 = true
Cfg_1_Win32 = true
CfgParent = Cfg_1
CG_64_BOOST_ROOT = C:\Program Files\Embarcadero\Studio\14.0\include\boost_1_50
CG_BOOST_ROOT = C:\Program Files\Embarcadero\Studio\14.0\include\boost_1_39
CLANG_UnwindTables = true
CleanDependsOn = 
      ResolveFiles;
      CleanOutputs;
      CleanResources;
    
CleanDependsOnTargets = 
      CleanOutputFiles;
      CleanAndroidApkRootDir;
      CleanLinkOutput;
      StaticPackageClean;
    
CommonLibraries = import32.lib
CommonProgramFiles = C:\Program Files\Common Files
COMPUTERNAME = THUNDERCLUMP-PC
ComSpec = C:\Windows\system32\cmd.exe
Config = Debug
CoreBuildDependsOn = 
      CreateDirectories;
      ValidateOptions;
      PreBuildEvent;
      ResolveFiles;
      ResourceBuild;
      ;
      CoreCompile;
      ;
      IntermediateClean;
      PostBuildEvent
    
CoreCompileDependsOnTargets = 
      RidlCompile;
      PasCompile;
      CppCompile;
      AsmCompile;
      RcCompile;
    
CreateDirectoriesDependsOn = 
      CreateProjectDirectories;
      CreateLocalDirectories
    
DCC_BpiOutput = .\Win32\Debug\
DCC_BplOutput = .\Win32\Debug\
DCC_CBuilderOutput = JPHNE
DCC_DcuOutput = .\Win32\Debug\
DCC_DebugInfoInExe = true
DCC_Define = DEBUG;_DEBUG;
DCC_GenerateCppFiles = true
DCC_IncludePath = ;c:\program files\embarcadero\studio\14.0\lib\Win32\release;C:\Users\Thunderclump\Documents\Embarcadero\Studio\14.0\Imports;C:\Program Files\Embarcadero\Studio\14.0\Imports;C:\Users\Thunderclump\Documents\Embarcadero\Studio\14.0\Dcp;C:\Program Files\Embarcadero\Studio\14.0\include
DCC_Namespace = Winapi;System.Win;Data.Win;Datasnap.Win;Web.Win;Soap.Win;Xml.Win;Bde;System;Xml;Data;Datasnap;Web;Soap;Vcl;Vcl.Imaging;Vcl.Touch;Vcl.Samples;Vcl.Shell;
DCC_ObjOutput = .\Win32\Debug\
DCC_ObjPath = ;c:\program files\embarcadero\studio\14.0\lib\Win32\release;C:\Users\Thunderclump\Documents\Embarcadero\Studio\14.0\Imports;C:\Program Files\Embarcadero\Studio\14.0\Imports;C:\Users\Thunderclump\Documents\Embarcadero\Studio\14.0\Dcp;C:\Program Files\Embarcadero\Studio\14.0\include
DCC_Optimize = false
DCC_ResourcePath = ;c:\program files\embarcadero\studio\14.0\lib\Win32\release;C:\Users\Thunderclump\Documents\Embarcadero\Studio\14.0\Imports;C:\Program Files\Embarcadero\Studio\14.0\Imports;C:\Users\Thunderclump\Documents\Embarcadero\Studio\14.0\Dcp;C:\Program Files\Embarcadero\Studio\14.0\include
DCC_UnitSearchPath = ;c:\program files\embarcadero\studio\14.0\lib\Win32\release;C:\Users\Thunderclump\Documents\Embarcadero\Studio\14.0\Imports;C:\Program Files\Embarcadero\Studio\14.0\Imports;C:\Users\Thunderclump\Documents\Embarcadero\Studio\14.0\Dcp;C:\Program Files\Embarcadero\Studio\14.0\include
DcpOutput = 
DcuOutput = 
DefaultPlatformSDK = 
DefaultProfile = 
Defines = _DEBUG;
DelphiBrowsingPath = C:\Program Files\Embarcadero\Studio\14.0\OCX\Servers;C:\Program Files\Embarcadero\Studio\14.0\SOURCE\VCL;C:\Program Files\Embarcadero\Studio\14.0\source\rtl\common;C:\Program Files\Embarcadero\Studio\14.0\SOURCE\RTL\SYS;C:\Program Files\Embarcadero\Studio\14.0\source\rtl\win;C:\Program Files\Embarcadero\Studio\14.0\source\ToolsAPI;C:\Program Files\Embarcadero\Studio\14.0\SOURCE\IBX;C:\Program Files\Embarcadero\Studio\14.0\source\Internet;C:\Program Files\Embarcadero\Studio\14.0\SOURCE\PROPERTY EDITORS;C:\Program Files\Embarcadero\Studio\14.0\source\soap;C:\Program Files\Embarcadero\Studio\14.0\SOURCE\XML;C:\Program Files\Embarcadero\Studio\14.0\source\Indy10\Core;C:\Program Files\Embarcadero\Studio\14.0\source\Indy10\System;C:\Program Files\Embarcadero\Studio\14.0\source\Indy10\Protocols;C:\Program Files\Embarcadero\Studio\14.0\source\fmx;C:\Program Files\Embarcadero\Studio\14.0\source\databinding\components;C:\Program Files\Embarcadero\Studio\14.0\source\databinding\engine;C:\Program Files\Embarcadero\Studio\14.0\source\databinding\graph;C:\Program Files\Embarcadero\Studio\14.0\source\data;C:\Program Files\Embarcadero\Studio\14.0\source\data\ado;C:\Program Files\Embarcadero\Studio\14.0\source\data\bde;C:\Program Files\Embarcadero\Studio\14.0\source\data\cloud;C:\Program Files\Embarcadero\Studio\14.0\source\data\datasnap;C:\Program Files\Embarcadero\Studio\14.0\source\data\dbx;C:\Program Files\Embarcadero\Studio\14.0\source\data\dsnap;C:\Program Files\Embarcadero\Studio\14.0\source\data\Test;C:\Program Files\Embarcadero\Studio\14.0\source\data\vclctrls;C:\Program Files\Embarcadero\Studio\14.0\source\data\datasnap\connectors;C:\Program Files\Embarcadero\Studio\14.0\source\data\datasnap\proxygen;C:\Program Files\Embarcadero\Studio\14.0\source\DataExplorer;C:\Program Files\Embarcadero\Studio\14.0\source\DUnit\Contrib\DUnitWizard\Source\Common;C:\Program Files\Embarcadero\Studio\14.0\source\DUnit\Contrib\DUnitWizard\Source\Common\dunit;C:\Program Files\Embarcadero\Studio\14.0\source\DUnit\Contrib\DUnitWizard\Source\DelphiExperts\Common;C:\Program Files\Embarcadero\Studio\14.0\source\DUnit\Contrib\DUnitWizard\Source\DelphiExperts\DUnitProject;C:\Program Files\Embarcadero\Studio\14.0\source\DUnit\Contrib\DUnitWizard\Source\DelphiExperts\DUnitProject\dunit;C:\Program Files\Embarcadero\Studio\14.0\source\DUnit\src;C:\Program Files\Embarcadero\Studio\14.0\source\DUnit\tests;C:\Program Files\Embarcadero\Studio\14.0\source\Experts;C:\Program Files\Embarcadero\Studio\14.0\source\indy\abstraction;C:\Program Files\Embarcadero\Studio\14.0\source\indy\implementation;C:\Program Files\Embarcadero\Studio\14.0\source\indyimpl;C:\Program Files\Embarcadero\Studio\14.0\source\LiveTile;C:\Program Files\Embarcadero\Studio\14.0\source\Property Editors\Indy10;C:\Program Files\Embarcadero\Studio\14.0\source\soap\wsdlimporter;C:\Program Files\Embarcadero\Studio\14.0\source\Visualizers;C:\Program Files\Embarcadero\Studio\14.0\source\xtab;C:\Program Files\Embarcadero\Studio\14.0\source\DUnit\Contrib\XMLReporting;C:\Program Files\Embarcadero\Studio\14.0\source\DUnit\Contrib\XPGen;C:\Program Files\Embarcadero\Studio\14.0\source\data\rest;C:\Program Files\Embarcadero\Studio\14.0\source\data\firedac;C:\Program Files\Embarcadero\Studio\14.0\source\tethering
DelphiDCPOutput = 
DelphiDebugDCUPath = 
DelphiDLLOutputPath = 
DelphiHPPOutputPath = 
DelphiLibraryPath = c:\program files\embarcadero\studio\14.0\lib\Win32\release;C:\Users\Thunderclump\Documents\Embarcadero\Studio\14.0\Imports;C:\Program Files\Embarcadero\Studio\14.0\Imports;C:\Users\Thunderclump\Documents\Embarcadero\Studio\14.0\Dcp;C:\Program Files\Embarcadero\Studio\14.0\include
DelphiNamespaceSearchPath = 
DelphiTranslatedDebugLibraryPath = 
DelphiTranslatedLibraryPath = 
DelphiTranslatedResourcePath = 
DEMOSDIR = C:\Users\Thunderclump\Documents\Embarcadero\Studio\14.0\Samples\
DependencyCheckDependsOnTargets = 
      _PasDepCheck;
      _RidlDepCheck;
      _CppDepCheck;
      _PCHDepCheck;
      _AsmDepCheck;
      _RcDepCheck;;
    
DeployDependsOnTargets = 
      _VerifyProfileFile;
      ;
      _CleanRemoteDir;
      _DeployFiles;
      _Codesign;
      _OSXAppStore;
      _Bundle;
      _AndroidPackaging;
      _CheckKeyStore;
      _AndroidSign;
      _AndroidZipAlign;
      _CheckAPKFileOutputResult;
      _DeleteAndroidAssetsInfoFile;
    
DllExt = dll
DllOutput = 
DllPlatformPrefix = 
DynamicRTL = true
EnvironmentSettings = C:\Users\Thunderclump\AppData\Roaming\Embarcadero\BDS\14.0\environment.proj
EnvOptions = C:\Users\Thunderclump\AppData\Roaming\Embarcadero\BDS\14.0\EnvOptions.proj
ExeExt = exe
ExeOutput = 
FinalOutput = .\Win32\Debug\Project1.exe
FinalOutputDir = .\Win32\Debug\
FP_NO_HOST_CHECK = NO
FrameworkDir = C:\Windows\Microsoft.NET\Framework\v3.5
FrameworkType = VCL
FrameworkVersion = v3.5
Gen64BitTypeLib = false
GENTLB_GenCppBindings = false
GENTLB_OutputName = Project1.tlb
HOMEDRIVE = C:
HOMEPATH = \Users\Thunderclump
HppOutput = 
IBREDISTDIR = C:\Users\Public\Documents\Embarcadero\InterBase\redist\InterBaseXE3
Icon_MainIcon = C:\Program Files\Embarcadero\Studio\14.0\bin\cbuilder_PROJECTICON.ico
ILINK_AdditionalLibs = import32.lib;cp32mti.lib
ILINK_AdditionalObjs = memmgr.lib;sysinit.obj
ILINK_AppType = Windows
ILINK_BpiLibOutputDir = .\Win32\Debug\
ILINK_FullDebugInfo = true
ILINK_LibraryPath = .\Win32\Debug\;C:\Program Files\Embarcadero\Studio\14.0\lib\win32\release\;\Win32\debug;;C:\Users\Public\Documents\Embarcadero\Studio\14.0\DCP\;c:\program files\embarcadero\studio\14.0\lib\win32\release;c:\program files\embarcadero\studio\14.0\lib\win32\release\psdk;C:\Users\Thunderclump\Documents\Embarcadero\Studio\14.0\DCP
ILINK_MapFileName = .\Win32\Debug\Project1.map
ILINK_ObjectSearchPath = .\Win32\Debug\;C:\Program Files\Embarcadero\Studio\14.0\lib\win32\release\;\Win32\debug;;C:\Users\Public\Documents\Embarcadero\Studio\14.0\DCP\;c:\program files\embarcadero\studio\14.0\lib\win32\release;c:\program files\embarcadero\studio\14.0\lib\win32\release\psdk;C:\Users\Thunderclump\Documents\Embarcadero\Studio\14.0\DCP
ILINK_OSVersion = 5.0
ILINK_PackageImports = rtl.bpi;vcl.bpi;@(PackageImport)
ILINK_PackageLibs = 
ILINK_StartupObjs = c0w32w
ILINK_TranslatedLibraryPath = \Win32\debug\EN;\Win32\release\EN;
ILINK_WinAppType = Executable
ILinkTarget = -Tpe
IncludePath = C:\Program Files\Embarcadero\Studio\14.0\include\windows\vcl;;C:\Program Files\Embarcadero\Studio\14.0\include\boost_1_39\boost\tr1\tr1;C:\Program Files\Embarcadero\Studio\14.0\include\boost_1_39;C:\Program Files\Embarcadero\Studio\14.0\include;C:\Program Files\Embarcadero\Studio\14.0\include\dinkumware;C:\Program Files\Embarcadero\Studio\14.0\include\windows\crtl;C:\Program Files\Embarcadero\Studio\14.0\include\windows\sdk;C:\Program Files\Embarcadero\Studio\14.0\include\windows\rtl;C:\Program Files\Embarcadero\Studio\14.0\include\windows\vcl;C:\WorkingDir\DaqBaseVisual
InputDir = @(InputFile->'%(RootDir)%(Directory)')
InputExt = @(InputFile->'%(Extension)')
InputFilename = @(InputFile->'%(Filename)%(Extension)')
InputName = @(InputFile->'%(Filename)')
InputPath = @(InputFile->'%(FullPath)')
IntermediateOutputDir = .\Win32\Debug\
LANGDIR = 
LibExt = lib
LinkDependsOnTargets = 
      ;_VerifyProfileFile;_CheckPlatformSDK;
      _ResolveOutput;
      CreateDirectories;
      PreLinkEvent;
      _PerformLink;
    
LinkPackageImports = rtl.bpi;vcl.bpi
LOCALAPPDATA = C:\Users\Thunderclump\AppData\Local
LOGONSERVER = \\THUNDERCLUMP-PC
MainSource = Project1.cpp
MakeDependsOnTargets = 
      ;_VerifyProfileFile;_CheckPlatformSDK;
      _CheckPlatformVariable;
      _MakePreReq;
      _ResolveOutput;
      CreateDirectories;
      _RunUserTools;
      PreBuildEvent;
      _PreOutputTimeStamp;
      MakeObjs;
      Link;
      _PostOutputTimeStamp;
      MakeStaticPackage;
      PostBuildEvent
    
MakeOneDependsOnTargets = 
      ;_VerifyProfileFile;_CheckPlatformSDK;
      _ResolveConfiguration;
      _MakeOnePreReq;
      _ResolveInput;
      _ResolveFileToCompile;
      CreateDirectories;
      PreBuildEvent;
      _PreOutputTimeStamp;
      _MakeOne;
      _PostOutputTimeStamp;
      PostBuildEvent;
    
Manifest_File = C:\Program Files\Embarcadero\Studio\14.0\bin\default_app.manifest
MSBuildBinPath = C:\Windows\Microsoft.NET\Framework\v2.0.50727
MSBuildExtensionsPath = C:\Program Files\MSBuild
MSBuildExtensionsPath32 = C:\Program Files\MSBuild
MSBuildNodeCount = 1
MSBuildProjectDefaultTargets = Make
MSBuildProjectDirectory = C:\WorkingDir\TestProj
MSBuildProjectDirectoryNoRoot = WorkingDir\TestProj
MSBuildProjectExtension = .cbproj
MSBuildProjectFile = Project1.cbproj
MSBuildProjectFullPath = C:\WorkingDir\TestProj\Project1.cbproj
MSBuildProjectName = Project1
MSBuildStartupDirectory = C:\WorkingDir\TestProj
MSBuildToolsPath = C:\Windows\Microsoft.NET\Framework\v2.0.50727
MSBuildToolsVersion = 2.0
Multithreaded = true
NameSpace = Winapi;System.Win;Data.Win;Datasnap.Win;Web.Win;Soap.Win;Xml.Win;Bde;System;Xml;Data;Datasnap;Web;Soap;Vcl;Vcl.Imaging;Vcl.Touch;Vcl.Samples;Vcl.Shell;
NO_LINK = false
NUMBER_OF_PROCESSORS = 4
ObjExt = obj
ObjOutput = 
OS = Windows_NT
OutputDir = @(OutputFile->'%(RootDir)%(Directory)')
OutputExt = @(OutputFile->'%(Extension)')
OutputFilename = @(OutputFile->'%(Filename)%(Extension)')
OutputName = @(OutputFile->'%(Filename)')
OutputPath = @(OutputFile->'%(FullPath)')
PackageImports = adortl;bcbie;bcbsmp;bdertl;bindcomp;bindcompdbx;bindcompfmx;bindcompvcl;bindengine;CloudService;CustomIPTransport;dbexpress;dbrtl;dbxcds;DbxClientDriver;DbxCommonDriver;DBXInterBaseDriver;DBXMySQLDriver;DBXSqliteDriver;dsnap;dsnapcon;dsnapxml;fmx;fmxase;fmxdae;fmxobj;FMXTee;FmxTeeUI;IndyCore;IndyIPClient;IndyIPCommon;IndyIPServer;IndyProtocols;IndySystem;inet;inetdb;inetdbbde;inetdbxpress;MetropolisUILiveTile;RESTBackendComponents;RESTComponents;rtl;soapmidas;soaprtl;soapserver;svn;Tee;TeeDB;TeeUI;tethering;vcl;vclactnband;vcldb;vcldbx;vcldsnap;vclie;vclimg;VCLRESTComponents;vclribbon;VclSmp;vcltouch;vclx;xmlrtl;
Path = C:\Windows\Microsoft.NET\Framework\v3.5;;C:\Program Files\Embarcadero\Studio\14.0\bin;C:\Program Files\Embarcadero\Studio\14.0\bin64;C:\Perl\site\bin;C:\Perl\bin;C:\Program Files\Embarcadero\Studio\14.0\bin;C:\Users\Thunderclump\Documents\Embarcadero\Studio\14.0\Bpl;C:\Program Files\Embarcadero\Studio\14.0\bin64;C:\Users\Thunderclump\Documents\Embarcadero\Studio\14.0\Bpl\Win64;C:\Windows\system32;C:\Windows;C:\Windows\System32\Wbem;C:\Windows\System32\WindowsPowerShell\v1.0\;C:\Program Files\Git\cmd;C:\Users\Public\Documents\Embarcadero\Studio\14.0\BPL
PATHEXT = .COM;.EXE;.BAT;.CMD;.VBS;.VBE;.JS;.JSE;.WSF;.WSH;.MSC
Platform = Win32
PlatformSDK = 
PostBuildEventDependsOn = 
      _ResolveInput;
      _ResolveOutput;
    
PreBuildEventDependsOn = 
      _ResolveInput;
      _ResolveOutput;
    
PreLinkEventDependsOn = 
      _ResolveInput;
      _ResolveOutput;
    
PreprocessDependsOnTargets = 
      _CheckPlatformVariable;
      _VerifyProfileFile;_CheckPlatformSDK;;
      _ResolveInput;
    
PROCESSOR_ARCHITECTURE = x86
PROCESSOR_IDENTIFIER = x86 Family 21 Model 2 Stepping 0, AuthenticAMD
PROCESSOR_LEVEL = 21
PROCESSOR_REVISION = 0200
ProducedFileList = Project1.cbproj.filelist.txt
ProductVersion = 14.0
Profile = 
Profiles = C:\Program Files\Embarcadero\Studio\14.0\bin\CodeGear.Profiles.Targets
ProgramData = C:\ProgramData
ProgramFiles = C:\Program Files
ProjectDir = C:\WorkingDir\TestProj
ProjectExt = .cbproj
ProjectFilename = Project1.cbproj
ProjectGuid = {68F61259-EE80-4C5E-ABC8-47FA24CA3EFA}
ProjectName = Project1
ProjectOutputExtension = .exe
ProjectPath = C:\WorkingDir\TestProj\Project1.cbproj
ProjectType = CppVCLApplication
ProjectVersion = 15.4
PROMPT = $P$G
PSModulePath = C:\Windows\system32\WindowsPowerShell\v1.0\Modules\
PUBLIC = C:\Users\Public
RcCompileDependsOnTargets = _RcDepCheck;
ReBuildDependsOn = 
      ResolveFiles;
      Clean;
      Build
    
ResolveFilesDependsOn = 
      _ResolveConfiguration;
      ResolveSources;
      ResolveResources;
      ResolveLocalResources;
      ResolvePaths;
      ResolveOutputs
    
ResourceBuildDependsOn = 
      Win32ResourceDependencies;
      BuildWin32Resources
    
ResourceOutput = 
RTLLib = cp32mti.lib
SanitizedProjectName = Project1
SESSIONNAME = Console
ShowStdOut = 
StartupObj = c0w32w
StartupObjConsole = c0x32
StartupObjGui = c0w32
StartupObjLibrary = c0d32
StartupObjPackage = c0pkg32
SystemDrive = C:
SystemRoot = C:\Windows
TargetedPlatforms = 1
TASM_Debugging = Full
TASM_Defines = _DEBUG;
TASM_DisplaySourceLines = true
TASM_IncludePath = C:\Program Files\Embarcadero\Studio\14.0\include\windows\vcl;
TASM_OutputDir = .\Win32\Debug\
TEMP = C:\Users\THUNDE~1\AppData\Local\Temp
TMP = C:\Users\THUNDE~1\AppData\Local\Temp
UnitAliases = Generics.Collections=System.Generics.Collections;Generics.Defaults=System.Generics.Defaults;WinTypes=Winapi.Windows;WinProcs=Winapi.Windows;DbiTypes=BDE;DbiProcs=BDE;DbiErrs=BDE
UsePackages = true
USERDOMAIN = Thunderclump-PC
USERNAME = Thunderclump
USERPROFILE = C:\Users\Thunderclump
USING_CLANG = false
USING_LD = false
UsingDelphiRTL = true
ValidateOptionsDependsOn = 
      ValidateGlobalOptions;
      ValidateSources;
      ValidateLocalResources;
      ValidatePaths
    
VerInfo_IncludeVerInfo = true
VerInfo_Keys = CompanyName=;FileDescription=;FileVersion=1.0.0.0;InternalName=;LegalCopyright=;LegalTrademarks=;OriginalFilename=;ProductName=;ProductVersion=1.0.0.0;Comments=
VerInfo_Locale = 1033
windir = C:\Windows
windows_tracing_flags = 3
windows_tracing_logfile = C:\BVTBin\Tests\installpackage\csilogfile.log
 
Initial Items:
_DirectoryList
    .\Win32\Debug\
    .\Win32\Debug\
    .\Win32\Debug\
    .\Win32\Debug\
    .\Win32\Debug\
    .\Win32\Debug\
    .\Win32\Debug\
BuildConfiguration
    Base
    Debug
    Release
CppCompile
    Project1.cpp
    Unit1.cpp
FormResources
    Unit1.dfm
PCHCompile
    Project1PCH1.h
 
Building with tools version "2.0".
Target "_VerifyProfileFile: (TargetId:0)" in file "C:\Program Files\Embarcadero\Studio\14.0\bin\CodeGear.Profiles.Targets" from project "C:\WorkingDir\TestProj\Project1.cbproj":
Task "Error" skipped, due to false condition; ('$(Profile)'!='' And !Exists('$(APPDATA)\Embarcadero\$(BDSAPPDATABASEDIR)\$(ProductVersion)\$(Profile).profile')) was evaluated as (''!='' And !Exists('C:\Users\Thunderclump\AppData\Roaming\Embarcadero\BDS\14.0\.profile')).
Done building target "_VerifyProfileFile" in project "Project1.cbproj".: (TargetId:0)
Target "_VerifyPlatformSDKFile: (TargetId:1)" in file "C:\Program Files\Embarcadero\Studio\14.0\bin\CodeGear.Profiles.Targets" from project "C:\WorkingDir\TestProj\Project1.cbproj":
Task "Error" skipped, due to false condition; ('$(PlatformSDK)'!='' And !Exists('$(APPDATA)\Embarcadero\$(BDSAPPDATABASEDIR)\$(ProductVersion)\$(PlatformSDK)')) was evaluated as (''!='' And !Exists('C:\Users\Thunderclump\AppData\Roaming\Embarcadero\BDS\14.0\')).
Done building target "_VerifyPlatformSDKFile" in project "Project1.cbproj".: (TargetId:1)
Target "_CheckPlatformSDK: (TargetId:2)" in file "C:\Program Files\Embarcadero\Studio\14.0\bin\CodeGear.Profiles.Targets" from project "C:\WorkingDir\TestProj\Project1.cbproj":
Task "Error" skipped, due to false condition; ('$(PlatformSDK)'!='' And !Exists('$(APPDATA)\Embarcadero\$(BDSAPPDATABASEDIR)\$(ProductVersion)\$(PlatformSDK)')) was evaluated as (''!='' And !Exists('C:\Users\Thunderclump\AppData\Roaming\Embarcadero\BDS\14.0\')).
Task "CallTarget" skipped, due to false condition; ('$(PlatformSDK)'!='' And '$(Platform)'=='$(Profile_platform)' And Exists('$(APPDATA)\Embarcadero\$(BDSAPPDATABASEDIR)\$(ProductVersion)\$(PlatformSDK)')) was evaluated as (''!='' And 'Win32'=='' And Exists('C:\Users\Thunderclump\AppData\Roaming\Embarcadero\BDS\14.0\')).
Done building target "_CheckPlatformSDK" in project "Project1.cbproj".: (TargetId:2)
Target "_CheckPlatformVariable: (TargetId:11)" in file "C:\Program Files\Embarcadero\Studio\14.0\bin\CodeGear.Common.Targets" from project "C:\WorkingDir\TestProj\Project1.cbproj":
Task "Error" skipped, due to false condition; (!(('$(Platform)'=='Win32') Or ('$(Platform)'=='WinNX32') Or ('$(Platform)'=='Win64') Or ('$(Platform)'=='OSX32') Or ('$(Platform)'=='Android') Or ('$(Platform)'=='iOSSimulator') Or ('$(Platform)'=='iOSDevice'))) was evaluated as (!(('Win32'=='Win32') Or ('Win32'=='WinNX32') Or ('Win32'=='Win64') Or ('Win32'=='OSX32') Or ('Win32'=='Android') Or ('Win32'=='iOSSimulator') Or ('Win32'=='iOSDevice'))).
Done building target "_CheckPlatformVariable" in project "Project1.cbproj".: (TargetId:11)
Target "_MakePreReq: (TargetId:113)" in file "C:\Program Files\Embarcadero\Studio\14.0\Bin\CodeGear.Cpp.Targets" from project "C:\WorkingDir\TestProj\Project1.cbproj":
Task "Error" skipped, due to false condition; ('$(FileToCompile)'!='') was evaluated as (''!='').
Done building target "_MakePreReq" in project "Project1.cbproj".: (TargetId:113)
Target "__CreateVerOutputName: (TargetId:59)" in file "C:\Program Files\Embarcadero\Studio\14.0\bin\CodeGear.Common.Targets" from project "C:\WorkingDir\TestProj\Project1.cbproj":
Using "CreateItem" task from assembly "Microsoft.Build.Tasks, Version=2.0.0.0, Culture=neutral, PublicKeyToken=b03f5f7f11d50a3a".
Task "CreateItem" (TaskId:6)
Done executing task "CreateItem". (TaskId:6)
Done building target "__CreateVerOutputName" in project "Project1.cbproj".: (TargetId:59)
Target "__SetVersionResourceFileName: (TargetId:48)" in file "C:\Program Files\Embarcadero\Studio\14.0\bin\CodeGear.Common.Targets" from project "C:\WorkingDir\TestProj\Project1.cbproj":
Task "CreateItem" (TaskId:7)
Done executing task "CreateItem". (TaskId:7)
Task "CreateItem" (TaskId:8)
Done executing task "CreateItem". (TaskId:8)
Done building target "__SetVersionResourceFileName" in project "Project1.cbproj".: (TargetId:48)
Target "__ResourceVersionResDepCheck: (TargetId:49)" in file "C:\Program Files\Embarcadero\Studio\14.0\bin\CodeGear.Common.Targets" from project "C:\WorkingDir\TestProj\Project1.cbproj":
Using "DependencyCheck" task from assembly "C:\Program Files\Embarcadero\Studio\14.0\bin\Borland.Build.Tasks.Shared.dll".
Task "DependencyCheck" (TaskId:9)
Done executing task "DependencyCheck". (TaskId:9)
Done building target "__ResourceVersionResDepCheck" in project "Project1.cbproj".: (TargetId:49)
Target "__InfoPlistDepCheck" skipped, due to false condition; (('$(Platform)'=='OSX32' Or '$(Platform)'=='iOSSimulator' Or '$(Platform)'=='iOSDevice')) was evaluated as (('Win32'=='OSX32' Or 'Win32'=='iOSSimulator' Or 'Win32'=='iOSDevice')).
Target "__ResourceRulesPlistDepCheck" skipped, due to false condition; (('$(Platform)'=='iOSDevice') And ('$(BT_BuildType)'=='Adhoc' Or '$(BT_BuildType)'=='AppStore')) was evaluated as (('Win32'=='iOSDevice') And (''=='Adhoc' Or ''=='AppStore')).
Target "__EntitlementsDepCheck" skipped, due to false condition; (('$(Platform)'=='OSX32' Or '$(Platform)'=='iOSSimulator' Or '$(Platform)'=='iOSDevice')) was evaluated as (('Win32'=='OSX32' Or 'Win32'=='iOSSimulator' Or 'Win32'=='iOSDevice')).
Target "__AndroidManifestDepCheck" skipped, due to false condition; ('$(Platform)'=='Android') was evaluated as ('Win32'=='Android').
Target "_ResolveIcons: (TargetId:32)" in file "C:\Program Files\Embarcadero\Studio\14.0\bin\CodeGear.Common.Targets" from project "C:\WorkingDir\TestProj\Project1.cbproj":
Task "CreateItem" skipped, due to false condition; ('$(Platform)'=='OSX32' and $(FinalOutputDir)!='') was evaluated as ('Win32'=='OSX32' and .\Win32\Debug\!='').
Task "CreateItem" skipped, due to false condition; ('$(Platform)'=='OSX32' and @(OutputFile)!='') was evaluated as ('Win32'=='OSX32' and !='').
Task "CreateItem" (TaskId:12)
Done executing task "CreateItem". (TaskId:12)
Task "CreateItem" (TaskId:13)
Done executing task "CreateItem". (TaskId:13)
Done building target "_ResolveIcons" in project "Project1.cbproj".: (TargetId:32)
Target "_ResolveCompiledOutput: (TargetId:128)" in file "C:\Program Files\Embarcadero\Studio\14.0\Bin\CodeGear.Cpp.Targets" from project "C:\WorkingDir\TestProj\Project1.cbproj":
Task "CreateItem" (TaskId:14)
Done executing task "CreateItem". (TaskId:14)
Task "CreateItem" (TaskId:15)
Done executing task "CreateItem". (TaskId:15)
Task "CreateItem" (TaskId:16)
Done executing task "CreateItem". (TaskId:16)
Task "CreateItem" (TaskId:17)
Done executing task "CreateItem". (TaskId:17)
Task "CreateItem" skipped, due to false condition; ('@(RidlCompile)'!='') was evaluated as (''!='').
Task "CreateItem" skipped, due to false condition; ('@(RcItem)'!='') was evaluated as (''!='').
Task "CreateItem" (TaskId:20)
Done executing task "CreateItem". (TaskId:20)
Task "CreateItem" (TaskId:21)
Done executing task "CreateItem". (TaskId:21)
Done building target "_ResolveCompiledOutput" in project "Project1.cbproj".: (TargetId:128)
Target "__SetProjectResourceFileName: (TargetId:127)" in file "C:\Program Files\Embarcadero\Studio\14.0\Bin\CodeGear.Cpp.Targets" from project "C:\WorkingDir\TestProj\Project1.cbproj":
Task "CreateItem" skipped, due to false condition; ('@(RcItem)'!='') was evaluated as (''!='').
Task "CreateItem" skipped, due to false condition; ('@(RcItem)'!='') was evaluated as (''!='').
Done building target "__SetProjectResourceFileName" in project "Project1.cbproj".: (TargetId:127)
Target "_ResolveOther: (TargetId:130)" in file "C:\Program Files\Embarcadero\Studio\14.0\Bin\CodeGear.Cpp.Targets" from project "C:\WorkingDir\TestProj\Project1.cbproj":
Task "CreateItem" (TaskId:24)
Done executing task "CreateItem". (TaskId:24)
Task "CreateItem" (TaskId:25)
Done executing task "CreateItem". (TaskId:25)
Task "CreateItem" (TaskId:26)
Done executing task "CreateItem". (TaskId:26)
Task "CreateItem" (TaskId:27)
Done executing task "CreateItem". (TaskId:27)
Task "CreateItem" (TaskId:28)
Done executing task "CreateItem". (TaskId:28)
Task "CreateItem" (TaskId:29)
Done executing task "CreateItem". (TaskId:29)
Task "CreateItem" (TaskId:30)
Done executing task "CreateItem". (TaskId:30)
Task "CreateItem" (TaskId:31)
Done executing task "CreateItem". (TaskId:31)
Task "CreateItem" (TaskId:32)
Done executing task "CreateItem". (TaskId:32)
Task "CreateItem" (TaskId:33)
Done executing task "CreateItem". (TaskId:33)
Task "CreateItem" (TaskId:34)
Done executing task "CreateItem". (TaskId:34)
Task "CreateItem" (TaskId:35)
Done executing task "CreateItem". (TaskId:35)
Task "CreateItem" (TaskId:36)
Done executing task "CreateItem". (TaskId:36)
Task "CreateItem" skipped, due to false condition; ('$(AppType)'=='Package' And '$(ILINK_GenerateImportLibrary)'=='true') was evaluated as ('Application'=='Package' And ''=='true').
Task "CreateItem" skipped, due to false condition; ('$(AppType)'!='Package' And '$(ILINK_GenerateImportLibrary)'=='true') was evaluated as ('Application'!='Package' And ''=='true').
Task "CreateItem" (TaskId:39)
Done executing task "CreateItem". (TaskId:39)
Task "CreateItem" (TaskId:40)
Done executing task "CreateItem". (TaskId:40)
Task "CreateItem" (TaskId:41)
Done executing task "CreateItem". (TaskId:41)
Task "CreateItem" skipped, due to false condition; ('$(TASM_GenerateListingFile)'=='true') was evaluated as (''=='true').
Task "CreateItem" skipped, due to false condition; ('$(TASM_GenerateCrossRefFile)'=='true') was evaluated as (''=='true').
Task "CreateItem" (TaskId:44)
Done executing task "CreateItem". (TaskId:44)
Task "CreateItem" (TaskId:45)
Done executing task "CreateItem". (TaskId:45)
Task "CreateItem" (TaskId:46)
Done executing task "CreateItem". (TaskId:46)
Task "CreateItem" (TaskId:47)
Done executing task "CreateItem". (TaskId:47)
Task "CreateItem" (TaskId:48)
Done executing task "CreateItem". (TaskId:48)
Done building target "_ResolveOther" in project "Project1.cbproj".: (TargetId:130)
Target "CreateProjectDirectories: (TargetId:25)" in file "C:\Program Files\Embarcadero\Studio\14.0\bin\CodeGear.Common.Targets" from project "C:\WorkingDir\TestProj\Project1.cbproj":
Using "MakeDir" task from assembly "Microsoft.Build.Tasks, Version=2.0.0.0, Culture=neutral, PublicKeyToken=b03f5f7f11d50a3a".
Task "MakeDir" (TaskId:49)
Done executing task "MakeDir". (TaskId:49)
Done building target "CreateProjectDirectories" in project "Project1.cbproj".: (TargetId:25)
Target "_RunUserTools: (TargetId:21)" in file "C:\Program Files\Embarcadero\Studio\14.0\bin\CodeGear.Common.Targets" from project "C:\WorkingDir\TestProj\Project1.cbproj":
Task "InvokeMSBuild" skipped, due to false condition; ('%(UserTool.ToolName)'!='' And '$(FileToCompile)'=='') was evaluated as (''!='' And ''=='').
Task "InvokeMSBuild" skipped, due to false condition; ('@(InputFile)'!='' And '%(InputFile.ToolName)'!='') was evaluated as (''!='' And ''!='').
Done building target "_RunUserTools" in project "Project1.cbproj".: (TargetId:21)
Target "PreBuildEvent" skipped, due to false condition; ( '$(PreBuildEvent)'!='' And '$(KibitzCompile)'=='') was evaluated as ( ''!='' And ''=='').
Target "_PreOutputTimeStamp: (TargetId:15)" in file "C:\Program Files\Embarcadero\Studio\14.0\bin\CodeGear.Common.Targets" from project "C:\WorkingDir\TestProj\Project1.cbproj":
Task "CreateItem" (TaskId:52)
Done executing task "CreateItem". (TaskId:52)
Done building target "_PreOutputTimeStamp" in project "Project1.cbproj".: (TargetId:15)
Target "MakeObjs: (TargetId:138)" in file "C:\Program Files\Embarcadero\Studio\14.0\Bin\CodeGear.Cpp.Targets" from project "C:\WorkingDir\TestProj\Project1.cbproj":
Using "CallTarget" task from assembly "Microsoft.Build.Tasks, Version=2.0.0.0, Culture=neutral, PublicKeyToken=b03f5f7f11d50a3a".
Task "CallTarget" (TaskId:53)
Target "_RidlDepCheck: (TargetId:75)" in file "C:\Program Files\Embarcadero\Studio\14.0\bin\CodeGear.Common.Targets" from project "C:\WorkingDir\TestProj\Project1.cbproj":
Task "DependencyCheck" (TaskId:54)
Done executing task "DependencyCheck". (TaskId:54)
Task "MessageMap" skipped, due to false condition; ('@(SkippedRidlFiles)'!='') was evaluated as (''!='').
Task "MessageMap" skipped, due to false condition; ('@(RidlFiles)'!='' And '$(ForceRebuild)'!='true') was evaluated as (''!='' And ''!='true').
Done building target "_RidlDepCheck" in project "Project1.cbproj".: (TargetId:75)
Target "RidlCompile: (TargetId:76)" in file "C:\Program Files\Embarcadero\Studio\14.0\bin\CodeGear.Common.Targets" from project "C:\WorkingDir\TestProj\Project1.cbproj":
Task "CallTarget" (TaskId:57)
Target "_ResolveGENTLBBindings: (TargetId:135)" in file "C:\Program Files\Embarcadero\Studio\14.0\Bin\CodeGear.Cpp.Targets" from project "C:\WorkingDir\TestProj\Project1.cbproj":
Task "CreateItem" (TaskId:58)
Done executing task "CreateItem". (TaskId:58)
Task "CreateItem" (TaskId:59)
Done executing task "CreateItem". (TaskId:59)
Done building target "_ResolveGENTLBBindings" in project "Project1.cbproj".: (TargetId:135)
Target "_RidlCoreCompile: (TargetId:77)" in file "C:\Program Files\Embarcadero\Studio\14.0\bin\CodeGear.Common.Targets" from project "C:\WorkingDir\TestProj\Project1.cbproj":
Task "GenTLB" skipped, due to false condition; ('@(RidlFiles)'!='') was evaluated as (''!='').
Done building target "_RidlCoreCompile" in project "Project1.cbproj".: (TargetId:77)
Done executing task "CallTarget". (TaskId:57)
Done building target "RidlCompile" in project "Project1.cbproj".: (TargetId:76)
Target "_PasDepCheck: (TargetId:116)" in file "C:\Program Files\Embarcadero\Studio\14.0\Bin\CodeGear.Cpp.Targets" from project "C:\WorkingDir\TestProj\Project1.cbproj":
Task "DependencyCheck" (TaskId:61)
Done executing task "DependencyCheck". (TaskId:61)
Using "ItemSort" task from assembly "C:\Program Files\Embarcadero\Studio\14.0\bin\Borland.Build.Tasks.Shared.dll".
Task "ItemSort" (TaskId:62)
Done executing task "ItemSort". (TaskId:62)
Using "MessageMap" task from assembly "C:\Program Files\Embarcadero\Studio\14.0\bin\Borland.Build.Tasks.Shared.dll".
Task "MessageMap" (TaskId:63)
  Skipping: C:\WorkingDir\TestProj\Project1.cbproj (TaskId:63)
Done executing task "MessageMap". (TaskId:63)
Task "MessageMap" skipped, due to false condition; ('@(PasFiles)'!='' And '$(ForceRebuild)'!='true') was evaluated as (''!='' And ''!='true').
Done building target "_PasDepCheck" in project "Project1.cbproj".: (TargetId:116)
Target "PasCompile: (TargetId:151)" in file "C:\Program Files\Embarcadero\Studio\14.0\Bin\CodeGear.Cpp.Targets" from project "C:\WorkingDir\TestProj\Project1.cbproj":
Task "CallTarget" skipped, due to false condition; ('$(ForceRebuild)'=='true' And '@(PasFiles)'!='') was evaluated as (''=='true' And ''!='').
Task "CallTarget" skipped, due to false condition; ('$(ForceRebuild)'!='true' And '@(PasFiles)'!='') was evaluated as (''!='true' And ''!='').
Done building target "PasCompile" in project "Project1.cbproj".: (TargetId:151)
Target "_CppDepCheck: (TargetId:117)" in file "C:\Program Files\Embarcadero\Studio\14.0\Bin\CodeGear.Cpp.Targets" from project "C:\WorkingDir\TestProj\Project1.cbproj":
Using "BccDependencyCheck" task from assembly "C:\Program Files\Embarcadero\Studio\14.0\bin\Borland.Build.Tasks.Cpp.dll".
Task "BccDependencyCheck" (TaskId:67)
Done executing task "BccDependencyCheck". (TaskId:67)
Task "BccDependencyCheck" (TaskId:68)
Done executing task "BccDependencyCheck". (TaskId:68)
Task "ItemSort" (TaskId:69)
Done executing task "ItemSort". (TaskId:69)
Task "MessageMap" (TaskId:70)
  Skipping: Project1.cpp;Unit1.cpp (TaskId:70)
Done executing task "MessageMap". (TaskId:70)
Task "MessageMap" skipped, due to false condition; ('@(_CppFiles)'!='' And '$(ForceRebuild)'!='true') was evaluated as (''!='' And ''!='true').
Done building target "_CppDepCheck" in project "Project1.cbproj".: (TargetId:117)
Target "_PCHDepCheck: (TargetId:118)" in file "C:\Program Files\Embarcadero\Studio\14.0\Bin\CodeGear.Cpp.Targets" from project "C:\WorkingDir\TestProj\Project1.cbproj":
Task "BccDependencyCheck" skipped, due to false condition; (('$(Platform)'=='Win64' Or '$(Platform)'=='iOSDevice' Or '$(Platform)'=='Android') And '$(BCC_PCHUsage)'=='GenerateAndUse') was evaluated as (('Win32'=='Win64' Or 'Win32'=='iOSDevice' Or 'Win32'=='Android') And ''=='GenerateAndUse').
Task "MessageMap" skipped, due to false condition; ('@(SkippedPCHFiles)'!='') was evaluated as (''!='').
Done building target "_PCHDepCheck" in project "Project1.cbproj".: (TargetId:118)
Target "CppCompile: (TargetId:141)" in file "C:\Program Files\Embarcadero\Studio\14.0\Bin\CodeGear.Cpp.Targets" from project "C:\WorkingDir\TestProj\Project1.cbproj":
Task "CallTarget" (TaskId:74)
Target "_CppCoreCompile: (TargetId:142)" in file "C:\Program Files\Embarcadero\Studio\14.0\Bin\CodeGear.Cpp.Targets" from project "C:\WorkingDir\TestProj\Project1.cbproj":
Task "CallTarget" skipped, due to false condition; ($(USING_CLANG)) was evaluated as (false).
Task "CallTarget" (TaskId:76)
Target "_BCC32CoreCompile: (TargetId:145)" in file "C:\Program Files\Embarcadero\Studio\14.0\Bin\CodeGear.Cpp.Targets" from project "C:\WorkingDir\TestProj\Project1.cbproj":
Task "BCC32" skipped, due to false condition; ((('@(CppFiles)'!='' And '%(CppFiles.OptionOverrides)'!='true') Or '$(FileToCompile)'!='') Or '$(_KibitzTask)'!='') was evaluated as (((''!='' And ''!='true') Or ''!='') Or ''!='').
Task "InvokeMSBuild" skipped, due to false condition; (('%(CppFiles.OptionOverrides)'=='true' Or '%(CppFiles.HasBuildEvent)'=='true') And '$(FileToCompile)'=='') was evaluated as ((''=='true' Or ''=='true') And ''=='').
Done building target "_BCC32CoreCompile" in project "Project1.cbproj".: (TargetId:145)
Done executing task "CallTarget". (TaskId:76)
Done building target "_CppCoreCompile" in project "Project1.cbproj".: (TargetId:142)
Done executing task "CallTarget". (TaskId:74)
Done building target "CppCompile" in project "Project1.cbproj".: (TargetId:141)
Target "_AsmDepCheck: (TargetId:119)" in file "C:\Program Files\Embarcadero\Studio\14.0\Bin\CodeGear.Cpp.Targets" from project "C:\WorkingDir\TestProj\Project1.cbproj":
Task "DependencyCheck" (TaskId:79)
Done executing task "DependencyCheck". (TaskId:79)
Task "ItemSort" (TaskId:80)
Done executing task "ItemSort". (TaskId:80)
Task "MessageMap" skipped, due to false condition; ('@(SkippedAsmFiles)'!='') was evaluated as (''!='').
Task "MessageMap" skipped, due to false condition; ('@(AsmFiles)'!='' And '$(ForceRebuild)'!='true') was evaluated as (''!='' And ''!='true').
Done building target "_AsmDepCheck" in project "Project1.cbproj".: (TargetId:119)
Target "AsmCompile: (TargetId:158)" in file "C:\Program Files\Embarcadero\Studio\14.0\Bin\CodeGear.Cpp.Targets" from project "C:\WorkingDir\TestProj\Project1.cbproj":
Task "CallTarget" (TaskId:83)
Target "_AsmCoreCompile: (TargetId:159)" in file "C:\Program Files\Embarcadero\Studio\14.0\Bin\CodeGear.Cpp.Targets" from project "C:\WorkingDir\TestProj\Project1.cbproj":
Task "TASM32" skipped, due to false condition; (('@(AsmFiles)'!='' And ('%(AsmFiles.OptionOverrides)'!='true' And '%(AsmFiles.HasBuildEvent)'!='true')) Or '$(FileToCompile)'!='') was evaluated as ((''!='' And (''!='true' And ''!='true')) Or ''!='').
Task "InvokeMSBuild" skipped, due to false condition; (('%(AsmFiles.OptionOverrides)'=='true' Or '%(AsmFiles.HasBuildEvent)'=='true') And '$(FileToCompile)'=='') was evaluated as ((''=='true' Or ''=='true') And ''=='').
Done building target "_AsmCoreCompile" in project "Project1.cbproj".: (TargetId:159)
Done executing task "CallTarget". (TaskId:83)
Done building target "AsmCompile" in project "Project1.cbproj".: (TargetId:158)
Target "_RcDepCheck: (TargetId:120)" in file "C:\Program Files\Embarcadero\Studio\14.0\Bin\CodeGear.Cpp.Targets" from project "C:\WorkingDir\TestProj\Project1.cbproj":
Task "DependencyCheck" (TaskId:86)
Done executing task "DependencyCheck". (TaskId:86)
Task "ItemSort" (TaskId:87)
Done executing task "ItemSort". (TaskId:87)
Task "MessageMap" skipped, due to false condition; ('@(SkippedRcFiles)'!='') was evaluated as (''!='').
Task "MessageMap" skipped, due to false condition; ('@(RcFiles)'!='' And '$(ForceRebuild)'!='true') was evaluated as (''!='' And ''!='true').
Done building target "_RcDepCheck" in project "Project1.cbproj".: (TargetId:120)
Target "RcCompile: (TargetId:149)" in file "C:\Program Files\Embarcadero\Studio\14.0\Bin\CodeGear.Cpp.Targets" from project "C:\WorkingDir\TestProj\Project1.cbproj":
Task "CallTarget" (TaskId:90)
Target "__CreateVerOutputName" skipped. Previously built successfully.
Target "__BuildShouldBuildVersion" skipped. Previously built successfully.
Target "__BuildRCFile: (TargetId:62)" in file "C:\Program Files\Embarcadero\Studio\14.0\bin\CodeGear.Common.Targets" from project "C:\WorkingDir\TestProj\Project1.cbproj":
Task "CallTarget" skipped, due to false condition; ('$(__ShouldBuildVersion)'=='true') was evaluated as ('false'=='true').
Done building target "__BuildRCFile" in project "Project1.cbproj".: (TargetId:62)
Target "BuildVersionResource: (TargetId:63)" in file "C:\Program Files\Embarcadero\Studio\14.0\bin\CodeGear.Common.Targets" from project "C:\WorkingDir\TestProj\Project1.cbproj":
Task "BRCC32" skipped, due to false condition; ('$(__ShouldBuildVersion)'=='true') was evaluated as ('false'=='true').
Task "Delete" skipped, due to false condition; (Exists('@(__ProjectVersionFile)') And ('$(SaveVRC)'!='true')) was evaluated as (Exists('Project1.vrc') And (''!='true')).
Done building target "BuildVersionResource" in project "Project1.cbproj".: (TargetId:63)
Done executing task "CallTarget". (TaskId:90)
Task "CallTarget" (TaskId:94)
Target "__CheckFullBundleId" skipped, due to false condition; ('$(Platform)'=='iOSDevice' And '$(BT_BuildType)'=='AppStore') was evaluated as ('Win32'=='iOSDevice' And ''=='AppStore').
Target "BuildEntitlementList: (TargetId:67)" in file "C:\Program Files\Embarcadero\Studio\14.0\bin\CodeGear.Common.Targets" from project "C:\WorkingDir\TestProj\Project1.cbproj":
Task "CreateEntitlementFile" skipped, due to false condition; ('$(ShouldGenEntitlementFile)'=='true') was evaluated as (''=='true').
Done building target "BuildEntitlementList" in project "Project1.cbproj".: (TargetId:67)
Done executing task "CallTarget". (TaskId:94)
Task "CallTarget" (TaskId:96)
Target "BuildAndroidManifestList: (TargetId:69)" in file "C:\Program Files\Embarcadero\Studio\14.0\bin\CodeGear.Common.Targets" from project "C:\WorkingDir\TestProj\Project1.cbproj":
Task "CreateAndroidManifestFile" skipped, due to false condition; ('$(ShouldCreateManifestFile)'=='true') was evaluated as (''=='true').
Done building target "BuildAndroidManifestList" in project "Project1.cbproj".: (TargetId:69)
Done executing task "CallTarget". (TaskId:96)
Task "CallTarget" (TaskId:98)
Target "_RcCoreCompile: (TargetId:150)" in file "C:\Program Files\Embarcadero\Studio\14.0\Bin\CodeGear.Cpp.Targets" from project "C:\WorkingDir\TestProj\Project1.cbproj":
Task "BRCC32" skipped, due to false condition; ((('@(RcFiles)'!='' And ('%(RcFiles.OptionOverrides)'!='true' And '%(RcFiles.HasBuildEvent)'!='true')) Or $(FileToCompile)!='') Or '$(_KibitzTask)'!='') was evaluated as (((''!='' And (''!='true' And ''!='true')) Or !='') Or ''!='').
Task "InvokeMSBuild" skipped, due to false condition; (('%(RcFiles.OptionOverrides)'=='true' Or '%(RcFiles.HasBuildEvent)'=='true') And '$(FileToCompile)'=='') was evaluated as ((''=='true' Or ''=='true') And ''=='').
Done building target "_RcCoreCompile" in project "Project1.cbproj".: (TargetId:150)
Done executing task "CallTarget". (TaskId:98)
Task "CallTarget" (TaskId:101)
Target "BuildProjectResourceFile" skipped, due to false condition; ('@(RcItem)'!='') was evaluated as (''!='').
Done executing task "CallTarget". (TaskId:101)
Done building target "RcCompile" in project "Project1.cbproj".: (TargetId:149)
Done executing task "CallTarget". (TaskId:53)
Done building target "MakeObjs" in project "Project1.cbproj".: (TargetId:138)
Target "_VerifyProfileFile" skipped. Previously built successfully.
Target "_CheckPlatformSDK" skipped. Previously built successfully.
Target "_ResolveOutput" skipped. Previously built successfully.
Target "CreateDirectories" skipped. Previously built successfully.
Target "PreLinkEvent" skipped, due to false condition; ( '$(PreLinkEvent)'!='' And '$(KibitzCompile)'=='') was evaluated as ( ''!='' And ''=='').
Target "_ResolveOutput" skipped. Previously built successfully.
Target "_ResolveUserObjNames: (TargetId:122)" in file "C:\Program Files\Embarcadero\Studio\14.0\Bin\CodeGear.Cpp.Targets" from project "C:\WorkingDir\TestProj\Project1.cbproj":
Task "CreateItem" (TaskId:102)
Done executing task "CreateItem". (TaskId:102)
Task "CreateItem" skipped, due to false condition; ('%(ObjFiles.IgnorePath)'=='true') was evaluated as (''=='true').
Done building target "_ResolveUserObjNames" in project "Project1.cbproj".: (TargetId:122)
Target "_ResolveUserLibNames: (TargetId:123)" in file "C:\Program Files\Embarcadero\Studio\14.0\Bin\CodeGear.Cpp.Targets" from project "C:\WorkingDir\TestProj\Project1.cbproj":
Task "CreateItem" (TaskId:104)
Done executing task "CreateItem". (TaskId:104)
Task "CreateItem" skipped, due to false condition; ('%(LibFiles.IgnorePath)'=='true') was evaluated as (''=='true').
Done building target "_ResolveUserLibNames" in project "Project1.cbproj".: (TargetId:123)
Target "_ResolveOutput" skipped. Previously built successfully.
Target "_CopyPackageLibs: (TargetId:124)" in file "C:\Program Files\Embarcadero\Studio\14.0\Bin\CodeGear.Cpp.Targets" from project "C:\WorkingDir\TestProj\Project1.cbproj":
Task "CreateItem" (TaskId:106)
Done executing task "CreateItem". (TaskId:106)
Task "CreateItem" (TaskId:107)
Done executing task "CreateItem". (TaskId:107)
Done building target "_CopyPackageLibs" in project "Project1.cbproj".: (TargetId:124)
Target "_CheckLinkDependencies: (TargetId:125)" in file "C:\Program Files\Embarcadero\Studio\14.0\Bin\CodeGear.Cpp.Targets" from project "C:\WorkingDir\TestProj\Project1.cbproj":
Task "DependencyCheck" (TaskId:108)
Done executing task "DependencyCheck". (TaskId:108)
Task "DependencyCheck" skipped, due to false condition; ('$(TLibLink)'=='true' And '$(ForceLink)'!='true') was evaluated as (''=='true' And ''!='true').
Done building target "_CheckLinkDependencies" in project "Project1.cbproj".: (TargetId:125)
Target "_PerformLink: (TargetId:165)" in file "C:\Program Files\Embarcadero\Studio\14.0\Bin\CodeGear.Cpp.Targets" from project "C:\WorkingDir\TestProj\Project1.cbproj":
Task "CallTarget" (TaskId:110)
Target "_PerformBCCILink: (TargetId:166)" in file "C:\Program Files\Embarcadero\Studio\14.0\Bin\CodeGear.Cpp.Targets" from project "C:\WorkingDir\TestProj\Project1.cbproj":
Using "ILINK32" task from assembly "C:\Program Files\Embarcadero\Studio\14.0\bin\Borland.Build.Tasks.Cpp.dll".
Task "ILINK32" (TaskId:111)
  Command: (TaskId:111)
  C:\Program Files\Embarcadero\Studio\14.0\bin\ilink32.exe -G8 -L.\Win32\Debug;"C:\Program Files\Embarcadero\Studio\14.0\lib\win32\release";\Win32\debug;C:\Users\Public\Documents\Embarcadero\Studio\14.0\DCP;"c:\program files\embarcadero\studio\14.0\lib\win32\release";"c:\program files\embarcadero\studio\14.0\lib\win32\release\psdk";C:\Users\Thunderclump\Documents\Embarcadero\Studio\14.0\DCP -j.\Win32\Debug;"C:\Program Files\Embarcadero\Studio\14.0\lib\win32\release";\Win32\debug;C:\Users\Public\Documents\Embarcadero\Studio\14.0\DCP;"c:\program files\embarcadero\studio\14.0\lib\win32\release";"c:\program files\embarcadero\studio\14.0\lib\win32\release\psdk";C:\Users\Thunderclump\Documents\Embarcadero\Studio\14.0\DCP -l.\Win32\Debug -v -aa -V5.0 -Tpe  c0w32w rtl.bpi vcl.bpi memmgr.lib sysinit.obj .\Win32\Debug\Project1.obj .\Win32\Debug\Unit1.obj , .\Win32\Debug\Project1.exe , .\Win32\Debug\Project1.map , import32.lib cp32mti.lib , , Project1.res  (TaskId:111)
  The "ILINK32" task is using "ilink32" from "C:\Program Files\Embarcadero\Studio\14.0\bin\ilink32.exe". (TaskId:111)
  Turbo Incremental Link 6.70 Copyright (c) 1997-2014 Embarcadero Technologies, Inc. (TaskId:111)
C:\Program Files\Embarcadero\Studio\14.0\Bin\CodeGear.Cpp.Targets(3011,5): error : Fatal: Unable to open file '.LIB'
  The command exited with code 2. (TaskId:111)
Done executing task "ILINK32" -- FAILED. (TaskId:111)
Done building target "_PerformBCCILink" in project "Project1.cbproj" -- FAILED.: (TargetId:166)
Done executing task "CallTarget" -- FAILED. (TaskId:110)
Done building target "_PerformLink" in project "Project1.cbproj" -- FAILED.: (TargetId:165)
Done Building Project "C:\WorkingDir\TestProj\Project1.cbproj" (make target(s)) -- FAILED.
 
Project Performance Summary:
     1251 ms  C:\WorkingDir\TestProj\Project1.cbproj     1 calls
               1251 ms  make                                       1 calls
 
Target Performance Summary:
        0 ms  CreateLocalDirectories                     1 calls
        0 ms  __SetAndroidManifestSettings               1 calls
        0 ms  __BuildShouldBuildVersion                  1 calls
        0 ms  _ResolveOutput                             1 calls
        0 ms  CreateDirectories                          1 calls
        0 ms  BuildShouldBuildVersion                    1 calls
        0 ms  _CoreCompile                               1 calls
        1 ms  __SetEntitlementFileSettings               1 calls
        2 ms  BuildAndroidManifestList                   1 calls
        2 ms  BuildEntitlementList                       1 calls
        2 ms  _CheckPlatformVariable                     1 calls
        2 ms  _RidlCoreCompile                           1 calls
        2 ms  _VerifyProfileFile                         1 calls
        2 ms  _MakePreReq                                1 calls
        2 ms  _VerifyPlatformSDKFile                     1 calls
        3 ms  __BuildRCFile                              1 calls
        3 ms  _PCHDepCheck                               1 calls
        3 ms  BuildVersionResource                       1 calls
        3 ms  __SetProjectResourceFileName               1 calls
        3 ms  _BCC32CoreCompile                          1 calls
        3 ms  _RcCoreCompile                             1 calls
        3 ms  PasCompile                                 1 calls
        5 ms  _AsmCoreCompile                            1 calls
        5 ms  _RunUserTools                              1 calls
        5 ms  _CheckPlatformSDK                          1 calls
        6 ms  _CopyPackageLibs                           1 calls
        6 ms  _PreOutputTimeStamp                        1 calls
        6 ms  CreateProjectDirectories                   1 calls
        6 ms  _CheckLinkDependencies                     1 calls
        6 ms  _ResolveUserLibNames                       1 calls
        7 ms  _RidlDepCheck                              1 calls
        7 ms  _ResolveGENTLBBindings                     1 calls
        7 ms  _ResolveUserObjNames                       1 calls
        7 ms  __SetVersionResourceFileName               1 calls
        8 ms  _RcDepCheck                                1 calls
        8 ms  _AsmDepCheck                               1 calls
        9 ms  _CppCoreCompile                            1 calls
        9 ms  _ResolveIcons                              1 calls
        9 ms  AsmCompile                                 1 calls
       14 ms  CppCompile                                 1 calls
       16 ms  RidlCompile                                1 calls
       24 ms  __CreateVerOutputName                      1 calls
       27 ms  _PasDepCheck                               1 calls
       32 ms  __ResourceVersionResDepCheck               1 calls
       36 ms  _ResolveCompiledOutput                     1 calls
       39 ms  RcCompile                                  1 calls
       45 ms  _CppDepCheck                               1 calls
       60 ms  _ResolveOther                              1 calls
      200 ms  MakeObjs                                   1 calls
      395 ms  _PerformBCCILink                           1 calls
      401 ms  _PerformLink                               1 calls
 
Task Performance Summary:
        2 ms  MakeDir                                    1 calls
        6 ms  ItemSort                                   4 calls
       17 ms  MessageMap                                 2 calls
       19 ms  DependencyCheck                            6 calls
       24 ms  BccDependencyCheck                         2 calls
       80 ms  CreateItem                                39 calls
      390 ms  ILINK32                                    1 calls
      669 ms  CallTarget                                11 calls
 
Build FAILED.
 
"C:\WorkingDir\TestProj\Project1.cbproj" (make target) (1) ->
(_PerformBCCILink target) -> 
  C:\Program Files\Embarcadero\Studio\14.0\Bin\CodeGear.Cpp.Targets(3011,5): error : Fatal: Unable to open file '.LIB'
 
    0 Warning(s)
    1 Error(s)
 
Time Elapsed 00:00:01.25
Bruce Salzman


Posts: 56
Registered: 8/23/02
Re: [ilink32 Error] Fatal: Unable to open file '.LIB' (C++Builder XE6)  
Click to report abuse...   Click to reply to this thread Reply
  Posted: Jan 19, 2016 12:08 PM   in response to: Markus Svilans in response to: Markus Svilans
Markus Svilans wrote:

Here is the output when building my dummy test project, which also
fails with the same error, using the command line:

I'm not sure why, but that ilink32 command line has this in it:

\Win32\Debug\Project1.exe , .\Win32\Debug\Project1.map , import32.lib
cp32mti.lib , , Project1.res (TaskId:111)

Note the , ,

It there anything odd in the project defaults such as additional linker
options? Sometimes you have to look at the project's xml to find these
weird things.

--
Bruce
Markus Svilans

Posts: 5
Registered: 2/23/04
Re: [ilink32 Error] Fatal: Unable to open file '.LIB' (C++Builder XE6)  
Click to report abuse...   Click to reply to this thread Reply
  Posted: Jan 20, 2016 8:12 AM   in response to: Bruce Salzman in response to: Bruce Salzman
Bruce Salzman wrote:
\Win32\Debug\Project1.exe , .\Win32\Debug\Project1.map , import32.lib
cp32mti.lib , , Project1.res (TaskId:111)

Note the , ,

Hi Bruce,

That empty section in the ilink32 command line is for a DEF file when building dynamic libraries, which should be left empty for most EXE targets.
http://docwiki.embarcadero.com/RADStudio/Seattle/en/ILINK32.EXE,_the_32-bit_Incremental_Linker

Regards,
Markus
Josh Kelley

Posts: 75
Registered: 3/6/08
Re: [ilink32 Error] Fatal: Unable to open file '.LIB' (C++Builder XE6)  
Click to report abuse...   Click to reply to this thread Reply
  Posted: Jan 19, 2016 1:06 PM   in response to: Markus Svilans in response to: Markus Svilans
On 1/18/2016 12:54 PM, Markus Svilans wrote:
Has anybody experienced this?

[ilink32 Error] Fatal: Unable to open file '.LIB'

I've spent a lot of time dealing with similar errors. Unfortunately, I
don't remember how exactly I finally got past them.

If I remember correctly, Windows' "compatibility files" (aka
VirtualStore) feature was involved. (A misconfigured process wrote bad
files under the RAD Studio installation directory as a non-admin, so
ilink32 found those bad files instead of the real files, because it's
not manifested as Vista-compatible. I kept missing them because I was
using Vista-and-above-compatible software that wasn't showing them.)

As a last resort, you might try running SysInternals' Process Monitor to
see if you can determine anything about what problematic files or paths
ilink32 is accessing.

--
Josh Kelley
Markus Svilans

Posts: 5
Registered: 2/23/04
Re: [ilink32 Error] Fatal: Unable to open file '.LIB' (C++Builder XE6)  
Click to report abuse...   Click to reply to this thread Reply
  Posted: Jan 20, 2016 8:14 AM   in response to: Josh Kelley in response to: Josh Kelley
Thanks for the tip, Josh.
I'll try using Process Monitor to see what filenames ilink32 is trying to access.
If you happen to recall any more details on how you got around this problem, I'd listen with a keen ear. This problem has been making me crazy for a while now.

All the best,
Markus

Josh Kelley wrote:
On 1/18/2016 12:54 PM, Markus Svilans wrote:
Has anybody experienced this?

[ilink32 Error] Fatal: Unable to open file '.LIB'

I've spent a lot of time dealing with similar errors. Unfortunately, I
don't remember how exactly I finally got past them.

If I remember correctly, Windows' "compatibility files" (aka
VirtualStore) feature was involved. (A misconfigured process wrote bad
files under the RAD Studio installation directory as a non-admin, so
ilink32 found those bad files instead of the real files, because it's
not manifested as Vista-compatible. I kept missing them because I was
using Vista-and-above-compatible software that wasn't showing them.)

As a last resort, you might try running SysInternals' Process Monitor to
see if you can determine anything about what problematic files or paths
ilink32 is accessing.

--
Josh Kelley
Kris Mertens

Posts: 2
Registered: 8/11/08
Re: [ilink32 Error] Fatal: Unable to open file '.LIB' (C++Builder XE6)  
Click to report abuse...   Click to reply to this thread Reply
  Posted: Mar 28, 2016 3:45 AM   in response to: Markus Svilans in response to: Markus Svilans
Hi Markus,

I'm in the exact same situation, unable to resolve it.
Did you get it fixed?

Regards,
Kris
Daniel Franke

Posts: 1
Registered: 7/23/04
Re: [ilink32 Error] Fatal: Unable to open file '.LIB' (C++Builder XE6)  
Click to report abuse...   Click to reply to this thread Reply
  Posted: May 29, 2017 12:55 PM   in response to: Kris Mertens in response to: Kris Mertens
Kris Mertens wrote:
Hi Markus,

I'm in the exact same situation, unable to resolve it.
Did you get it fixed?

Regards,
Kris

Hello Markus and Kris,

I'm have the same problem with C++ Builder 10.2.
Any solution?

Edited by: Daniel Franke on May 29, 2017 12:55 PM
Legend
Helpful Answer (5 pts)
Correct Answer (10 pts)

Server Response from: ETNAJIVE02